[Linux-HA] building srpm on rhel4 and pils

Michael Harrison mrpquter at yahoo.com
Sat Sep 22 08:49:19 MDT 2007


I downloaded heartbeat-2.1.2-2.src.rpm and
libnet- Built libnet rpm with no problems.

Trying to build the hearbeat rpm gives errors:

raexeclsb.c:47:29: libxml/entities.h: No such file or directory
raexeclsb.c: In function `get_resource_meta':
raexeclsb.c:522: warning: implicit declaration of function
raexeclsb.c:522: error: `BAD_CAST' undeclared (first use in this
raexeclsb.c:522: error: (Each undeclared identifier is reported only
raexeclsb.c:522: error: for each function it appears in.)
raexeclsb.c:522: error: syntax error before "buffer"
raexeclsb.c:523: error: syntax error before "buffer"
raexeclsb.c:524: error: syntax error before "buffer"
raexeclsb.c:525: error: syntax error before "buffer"
raexeclsb.c:526: error: syntax error before "buffer"
raexeclsb.c:527: error: syntax error before "buffer"
raexeclsb.c:528: error: syntax error before "buffer"
raexeclsb.c:529: error: syntax error before "buffer"
raexeclsb.c:554: warning: implicit declaration of function `BAD_CAST'
raexeclsb.c:554: warning: cast does not match function type
raexeclsb.c:579: warning: implicit declaration of function `xmlFree'
gmake[3]: *** [raexeclsb.lo] Error 1
gmake[3]: Leaving directory
gmake[2]: *** [all-recursive] Error 1
gmake[2]: Leaving directory
gmake[1]: *** [all-recursive] Error 1
gmake[1]: Leaving directory
make: *** [all-recursive] Error 1
error: Bad exit status from /var/tmp/rpm-tmp.41443 (%build)

RPM build errors:
    Bad exit status from /var/tmp/rpm-tmp.41443 (%build)

Any pointers? It looks to choke up at plugins, so do I need pils ? I
don't see that for download anywhere.


Looking for a deal? Find great prices on flights and hotels with Yahoo! FareChase.

More information about the Linux-HA mailing list